Org.apache.spark.sparkexception job aborted due to stage failure.

1. "Accept timed out" generally points to a problem with your spark instance. It may be overloaded or not enough resources (memory/cpu) to start your job or it might be a temporary network issue. You can monitor you jobs on Spark UI. Also there is some issue with your code.

Org.apache.spark.sparkexception job aborted due to stage failure. Things To Know About Org.apache.spark.sparkexception job aborted due to stage failure.

May 2, 2016 · Teams. Q&A for work. Connect and share knowledge within a single location that is structured and easy to search. Learn more about Teams one can solve this job aborted error, either changing the "spark configuration" in the cluster or either use "try_cast" function when you are getting this error while inserting data from one table to another table in databricks. use dbr version : 10.4 LTS (includes Apache Spark 3.2.1, Scala 2.12)Aug 20, 2018 · 报错如下: : org.apache.spark.SparkException: Job aborted due to stage failure: Task 0 in stage 3.0 failed 4 times, most recent failure: ... Here are some ideas to fix this error: Serializable the class. Declare the instance only within the lambda function passed in map. Make the NotSerializable object as a static and create it once per machine. Call rdd.forEachPartition and create the NotSerializable object in there like this: rdd.forEachPartition (iter -> { NotSerializable ...

For Spark jobs submitted with --deploy-mode cluster, run the following command on the master node to find stage failures in the YARN application logs. Replace application_id with the ID of your Spark application (for example, application_1572839353552_0008 ). yarn logs -applicationId application_id | grep "Job aborted due to stage failure" -A 10.

Mar 29, 2020 · Check Apache Spark installation on Windows 10 steps. Use different versions of Apache Spark (tried 2.4.3 / 2.4.2 / 2.3.4). Disable firewall windows and antivirus that I have installed. Tried to initialize the SparkContext manually with sc = spark.sparkContext (found this possible solution at this question here in Stackoverflow, didn´t work for ...

When a stage failure occurs, the Spark driver logs report an exception similar to the following: org.apache.spark.SparkException: Job aborted due to stage failure: Task XXX in stage YYY failed 4 times, most recent failure: Lost task XXX in stage YYY (TID ZZZ, ip-xxx-xx-x-xxx.compute.internal, executor NNN): ExecutorLostFailure (executor NNN ...Spark任务:Job aborted due to stage failure: Task 0 in stage 2.0 failed 4 times, most recent failure问题 跑Spark任务时报错,复制任务id(application_1111_222)到yarn页面中检索,发现报以下错误: Job aborted due to stage failure: Task 0 in stage 2.0 failed 4 times, most recent failure 使用sc读取SparkException: Job aborted due to stage failure: Task 58 in stage 13.0 failed 4 times, most recent failure: Lost task 58.3 in stage 13.0 (TID 488, 10.32.14.43, executor 4): java.lang.IllegalArgumentException: Illegal pattern character 'Q'Based on the code , am not seeing anything wrong . Still you can analysis this issue based on the following data related . Make sure 4th line lines rdd has the data based on the collect().Currently I'm doing PySpark and working on DataFrame. I've created a DataFrame: from pyspark.sql import * import pandas as pd spark = SparkSession.builder.appName("DataFarme").getOrCreate...

If I had a penny for every time I asked people "have you tried increasing the number of partitions to something quite large like at least 4 tasks per CPU - like even as high as 1000 partitions?"

I am running spark jobs using datafactory in azure databricks. My cluster vesion is 9.1 LTS ML (includes Apache Spark 3.1.2, Scala 2.12). I am writing data on azure blob storage. While writing job ...

Oct 30, 2018 · You need to change this parameter in the cluster configuration. Go into the cluster settings, under Advanced select spark and paste spark.driver.maxResultSize 0 (for unlimited) or whatever the value suits you. Using 0 is not recommended. You should optimize the job by re partitioning. org.apache.spark.SparkException: Job aborted due to stage failure: Task 3 in stage 6.0 failed 1 times, most recent failure: Lost task 3.0 in stage 6.0 (TID 62, LAPTOP-H7MM9952, executor driver): org.apache.spark.SparkException: Task failed while writing rows.@Tim, actually no I have set of operations like val source_primary_key = source.map(rec => (rec.split(",")(0), rec)) source_primary_key.persist(StorageLevel.DISK_ONLY) val extra_in_source = source_primary_key.subtractByKey(destination_primary_key) var pureextinsrc = extra_in_source.count() extra_in_source.cache()and so on but before this its throwing out of memory exception while im fetching ...Error: org.apache.spark.SparkException: Job aborted due to stage failure: Task 0 in stage 1985.0 failed 4 times, most recent failure: Lost task 0.3 in stage 1985.0 (TID 57569, 10.139.64.12, executor 15): com.microsoft.sqlserver.jdbc.SQLServerException: Conversion failed when converting the nvarchar value 'Aug' to data type int.If issue persists, please contact Microsoft support for further assistance","Details":"org.apache.spark.SparkException: Job aborted due to stage failure: Task 320 in stage 21.0 failed 1 times, most recent failure: Lost task 320.0 in stage 21.0 (TID 1297, vm-42929650, executor 1): ExecutorLostFailure (executor 1 exited caused by one of the ...

May 8, 2021 · org.apache.spark.SparkException: Job aborted due to stage failure: Task 3 in stage 6.0 failed 1 times, most recent failure: Lost task 3.0 in stage 6.0 (TID 62, LAPTOP-H7MM9952, executor driver): org.apache.spark.SparkException: Task failed while writing rows. Teams. Q&A for work. Connect and share knowledge within a single location that is structured and easy to search. Learn more about TeamsTeams. Q&A for work. Connect and share knowledge within a single location that is structured and easy to search. Learn more about Teamsorg.apache.spark.SparkException: Job aborted due to stage failure: Task XXX in stage YYY failed 4 times, most recent failure: Lost task XXX in stage YYY (TID ZZZ, ip-xxx-xx-x-xxx.compute.internal, executor NNN): ExecutorLostFailure (executor NNN exited caused by one of the running tasks) Reason: ... 解決方法 理由コードの検索 Nov 2, 2020 · Teams. Q&A for work. Connect and share knowledge within a single location that is structured and easy to search. Learn more about Teams org.apache.spark.SparkException: Job aborted due to stage failure: Task in stage failed,Lost task in stage : ExecutorLostFailure (executor 4 lost) 12 org.apache.spark.SparkException: Job aborted due to stage failure: Task 98 in stage 11.0 failed 4 times

Here are some ideas to fix this error: Serializable the class. Declare the instance only within the lambda function passed in map. Make the NotSerializable object as a static and create it once per machine. Call rdd.forEachPartition and create the NotSerializable object in there like this: rdd.forEachPartition (iter -> { NotSerializable ... org.apache.spark.SparkException: Job aborted due to stage failure: Task 2 in stage 0.0 failed 4 times, most recent failure: Lost task 2.3 in stage 0.0 Updating the dependancy in SBT solved the problem.

Go into the cluster settings, under Advanced select spark and paste spark.driver.maxResultSize 0 (for unlimited) or whatever the value suits you. Using 0 is not recommended. You should optimize the job by re partitioning. For more details, refer "Spark Configurations - Application Properties". Hope this helps. Do let us know if you any further ...Pyspark. spark.SparkException: Job aborted due to stage failure: Task 0 in stage 15.0 failed 1 times, java.net.SocketException: Connection reset Hot Network Questions Main character is charged an exorbitant computing bill after abusing his uploaded consciousness powersJob aborted due to stage failure: ShuffleMapStage 20 (repartition at data_prep.scala:87) has failed the maximum allowable number of times: 4 2 Why does Spark fail with FetchFailed error?Dec 29, 2018 · Teams. Q&A for work. Connect and share knowledge within a single location that is structured and easy to search. Learn more about Teams strange org.apache.spark.SparkException: Job aborted due to stage failure again. I'm trying to deploy spark application on standalone mode. In this application I'm training Naive Bayes classifier by using tf-idf vectors. I wrote application in similar manner to this post ( Spark MLLib TFIDF implementation for LogisticRegression ) The difference ...Teams. Q&A for work. Connect and share knowledge within a single location that is structured and easy to search. Learn more about TeamsCheck the Availability of Free RAM - whether it matches the expectation of the job being executed. Run below on each of the servers in the cluster and check how much RAM & Space they have in offer. free -h. If you are using any HDFS files in the Spark job , make sure to Specify & Correctly use the HDFS URL.Teams. Q&A for work. Connect and share knowledge within a single location that is structured and easy to search. Learn more about TeamsYou need to change this parameter in the cluster configuration. Go into the cluster settings, under Advanced select spark and paste spark.driver.maxResultSize 0 (for unlimited) or whatever the value suits you. Using 0 is not recommended. You should optimize the job by re partitioning. See the links below for more information: https://docs ...

May 16, 2022 · Problem Databricks throws an error when fitting a SparkML model or Pipeline: org.apache.spark.SparkException: Job aborted due to stage failure: Task 0 in s

Check your data for null where not null should be present and especially on those columns that are subject of aggregation, like a reduce task, for example. In your case, it may be the id field. Your rdd is getting empty somewhere. The null pointer exception indicates that an aggregation task is attempted against of a null value. Check your data ...

Solution 1. Check your environment variables. You are getting “py4j.protocol.Py4JError: org.apache.spark.api.python.PythonUtils.getEncryptionEnabled does not exist in the JVM” due to Spark environemnt variables are not set right.1. "Accept timed out" generally points to a problem with your spark instance. It may be overloaded or not enough resources (memory/cpu) to start your job or it might be a temporary network issue. You can monitor you jobs on Spark UI. Also there is some issue with your code.Error: org.apache.spark.SparkException: Job aborted due to stage failure: Task 0 in stage 1985.0 failed 4 times, most recent failure: Lost task 0.3 in stage 1985.0 (TID 57569, 10.139.64.12, executor 15): com.microsoft.sqlserver.jdbc.SQLServerException: Conversion failed when converting the nvarchar value 'Aug' to data type int.Apr 8, 2019 · scala - org.apache.spark.SparkException: Job aborted due to stage failure: Task 98 in stage 11.0 failed 4 times - Stack Overflow org.apache.spark.SparkException: Job aborted due to stage failure: Task 98 in stage 11.0 failed 4 times Ask Question Asked 4 years, 4 months ago Modified 4 years, 4 months ago Viewed 46k times org.apache.spark.SparkException: Job aborted due to stage failure: Task XXX in stage YYY failed 4 times, most recent failure: Lost task XXX in stage YYY (TID ZZZ, ip-xxx-xx-x-xxx.compute.internal, executor NNN): ExecutorLostFailure (executor NNN exited caused by one of the running tasks) Reason: ... 解決方法 理由コードの検索 Sep 1, 2022 · one can solve this job aborted error, either changing the "spark configuration" in the cluster or either use "try_cast" function when you are getting this error while inserting data from one table to another table in databricks. use dbr version : 10.4 LTS (includes Apache Spark 3.2.1, Scala 2.12) According to the content of README.md of GitHub repo Azure/azure-cosmosdb-spark as the figure below, you may should switch to use the latest jar file azure-cosmosdb-spark_2.4.0_2.11-1.4.0-uber.jar in it. And the maven repo for Azure CosmosDB Spark has released to 1.4.1 version, as the figure below.: org.apache.spark.SparkException: Job aborted due to stage failure: Task 9 in stage 47.0 failed 4 times, most recent failure: Lost task 9.3 in stage 47.0 (TID 2256, ip-172-31-00-00.eu-west-1.compute.internal, executor 10): org.apache.spark.sql.execution.QueryExecutionException: Parquet column cannot be converted in file s3a://bucket/prod ...Hi! I run 2 to spark an option SPARK_MAJOR_VERSION=2 pyspark --master yarn --verbose spark starts, I run the SC and get an error, the field in the table exactly there. not the problem SPARK_MAJOR_VERSION=2 pyspark --master yarn --verbose SPARK_MAJOR_VERSION is set to 2, using Spark2 Python 2.7.12 ...May 15, 2017 · : org.apache.spark.SparkException: Job aborted due to stage failure: Serialized task 302987:27 was 139041896 bytes, which exceeds max allowed: spark.akka.frameSize (134217728 bytes) - reserved (204800 bytes). Here are some ideas to fix this error: Serializable the class. Declare the instance only within the lambda function passed in map. Make the NotSerializable object as a static and create it once per machine. Call rdd.forEachPartition and create the NotSerializable object in there like this: rdd.forEachPartition (iter -> { NotSerializable ...

Stack Overflow Public questions & answers; Stack Overflow for Teams Where developers & technologists share private knowledge with coworkers; Talent Build your employer brand报错如下: : org.apache.spark.SparkException: Job aborted due to stage failure: Task 0 in stage 3.0 failed 4 times, most recent failure: ...Viewed 6k times. 4. I'm processing large spark dataframe in databricks and when I'm trying to write the final dataframe into csv format it gives me the following error: org.apache.spark.SparkException: Job aborted. #Creating a data frame with entire date seuence for each user df=pd.DataFrame ( {'transaction_date':dt_range2,'msno':msno1}) from ...Instagram:https://instagram. auto parts otanya olivingstonsamsung s22 ultra moisture detected won hello everyone I am working on PySpark Python and I have mentioned the code and getting some issue, I am wondering if someone knows about the following issue? windowSpec = Window.partitionBy(df['id']).orderBy(df_Broadcast['id']) windowSp... deepl translator extension833 431 3669 Apache Spark; koukou. ... org.apache.spark.SparkException: Job aborted due to stage failure: Task 0 in stage 30.0 failed 1 times, most recent failure: Lost task 0.0 ... cheap sectional sofas under dollar400 You may not have right permissions. I have the same problem when I use a docker image jupyter/pyspark-notebook to run an example code of pyspark, and it was solved by using root within the container.Jan 24, 2022 · 1 Answer. Sorted by: 1. You need to create an RDD of type RDD [Tuple [str]] but in your code, the line: rdd = spark.sparkContext.parallelize (comments) returns RDD [str] which then fails when you try to convert it to dataframe with that given schema. Try modifying that line to: